{"text_format":"1","workbook":"xlsx","n_sheets":4,"sheets":["Sample Information","Example","Source code","sample table mirror"],"not_rendered":{"charts":0,"images":0,"macros":1,"external_links":0,"defined_names":0,"comments":2,"pivot_tables":0},"unopened":[],"bounds":{"document_bytes":16777216,"sheet_cells":100000,"rows_first":2000,"rows_last":500,"rows_between":2000,"halvings":0,"cell_chars":16384,"cell_head_chars":4096},"cells_cut":0,"cells_raw":0,"read":"whole","date_system":"1900"}

{"sheet":"Sample Information","index":0,"n_rows":195,"n_cols":14,"rows_kept":195,"cut":false,"hidden":false,"merged":[[190,7,190,8],[190,9,190,10],[191,7,191,8],[191,9,191,10],[185,7,185,8],[185,9,185,10],[186,7,186,8],[186,9,186,10],[187,7,187,8],[187,9,187,10],[188,7,188,8],[188,9,188,10],[189,7,189,8],[189,9,189,10],[180,7,180,8],[180,9,180,10],[181,7,181,8],[181,9,181,10],[182,7,182,8],[182,9,182,10],[183,7,183,8],[183,9,183,10],[184,7,184,8],[184,9,184,10],[175,7,175,8],[175,9,175,10],[176,7,176,8],[176,9,176,10],[177,7,177,8],[177,9,177,10],[178,7,178,8],[178,9,178,10],[179,7,179,8],[179,9,179,10],[170,7,170,8],[170,9,170,10],[171,7,171,8],[171,9,171,10],[172,7,172,8],[172,9,172,10],[173,7,173,8],[173,9,173,10],[174,7,174,8],[174,9,174,10],[165,7,165,8],[165,9,165,10],[166,7,166,8],[166,9,166,10],[167,7,167,8],[167,9,167,10],[168,7,168,8],[168,9,168,10],[169,7,169,8],[169,9,169,10],[160,7,160,8],[160,9,160,10],[161,7,161,8],[161,9,161,10],[162,7,162,8],[162,9,162,10],[163,7,163,8],[163,9,163,10],[164,7,164,8],[164,9,164,10],[155,7,155,8],[155,9,155,10],[156,7,156,8],[156,9,156,10],[157,7,157,8],[157,9,157,10],[158,7,158,8],[158,9,158,10],[159,7,159,8],[159,9,159,10],[150,7,150,8],[150,9,150,10],[151,7,151,8],[151,9,151,10],[152,7,152,8],[152,9,152,10],[153,7,153,8],[153,9,153,10],[154,7,154,8],[154,9,154,10],[145,7,145,8],[145,9,145,10],[146,7,146,8],[146,9,146,10],[147,7,147,8],[147,9,147,10],[148,7,148,8],[148,9,148,10],[149,7,149,8],[149,9,149,10],[140,7,140,8],[140,9,140,10],[141,7,141,8],[141,9,141,10],[142,7,142,8],[142,9,142,10],[143,7,143,8],[143,9,143,10],[144,7,144,8],[144,9,144,10],[135,7,135,8],[135,9,135,10],[136,7,136,8],[136,9,136,10],[137,7,137,8],[137,9,137,10],[138,7,138,8],[138,9,138,10],[139,7,139,8],[139,9,139,10],[130,7,130,8],[130,9,130,10],[131,7,131,8],[131,9,131,10],[132,7,132,8],[132,9,132,10],[133,7,133,8],[133,9,133,10],[134,7,134,8],[134,9,134,10],[125,7,125,8],[125,9,125,10],[126,7,126,8],[126,9,126,10],[127,7,127,8],[127,9,127,10],[128,7,128,8],[128,9,128,10],[129,7,129,8],[129,9,129,10],[120,7,120,8],[120,9,120,10],[121,7,121,8],[121,9,121,10],[122,7,122,8],[122,9,122,10],[123,7,123,8],[123,9,123,10],[124,7,124,8],[124,9,124,10],[115,7,115,8],[115,9,115,10],[116,7,116,8],[116,9,116,10],[117,7,117,8],[117,9,117,10],[118,7,118,8],[118,9,118,10],[119,7,119,8],[119,9,119,10],[110,7,110,8],[110,9,110,10],[111,7,111,8],[111,9,111,10],[112,7,112,8],[112,9,112,10],[113,7,113,8],[113,9,113,10],[114,7,114,8],[114,9,114,10],[105,7,105,8],[105,9,105,10],[106,7,106,8],[106,9,106,10],[107,7,107,8],[107,9,107,10],[108,7,108,8],[108,9,108,10],[109,7,109,8],[109,9,109,10],[100,7,100,8],[100,9,100,10],[101,7,101,8],[101,9,101,10],[102,7,102,8],[102,9,102,10],[103,7,103,8],[103,9,103,10],[104,7,104,8],[104,9,104,10],[95,7,95,8],[95,9,95,10],[96,7,96,8],[96,9,96,10],[97,7,97,8],[97,9,97,10],[98,7,98,8],[98,9,98,10],[99,7,99,8],[99,9,99,10],[90,7,90,8],[90,9,90,10],[91,7,91,8],[91,9,91,10],[92,7,92,8],[92,9,92,10],[93,7,93,8],[93,9,93,10],[94,7,94,8],[94,9,94,10],[85,7,85,8],[85,9,85,10],[86,7,86,8],[86,9,86,10],[87,7,87,8],[87,9,87,10],[88,7,88,8],[88,9,88,10],[89,7,89,8],[89,9,89,10],[80,7,80,8],[80,9,80,10],[81,7,81,8],[81,9,81,10],[82,7,82,8],[82,9,82,10],[83,7,83,8],[83,9,83,10],[84,7,84,8],[84,9,84,10],[75,7,75,8],[75,9,75,10],[76,7,76,8],[76,9,76,10],[77,7,77,8],[77,9,77,10],[78,7,78,8],[78,9,78,10],[79,7,79,8],[79,9,79,10],[70,7,70,8],[70,9,70,10],[71,7,71,8],[71,9,71,10],[72,7,72,8],[72,9,72,10],[73,7,73,8],[73,9,73,10],[74,7,74,8],[74,9,74,10],[191,2,191,3],[182,2,182,3],[183,2,183,3],[184,2,184,3],[185,2,185,3],[186,2,186,3],[187,2,187,3],[188,2,188,3],[189,2,189,3],[190,2,190,3],[173,2,173,3],[174,2,174,3],[175,2,175,3],[176,2,176,3],[177,2,177,3],[178,2,178,3],[179,2,179,3],[180,2,180,3],[181,2,181,3],[164,2,164,3],[165,2,165,3],[166,2,166,3],[167,2,167,3],[168,2,168,3],[169,2,169,3],[170,2,170,3],[171,2,171,3],[172,2,172,3],[155,2,155,3],[156,2,156,3],[157,2,157,3],[158,2,158,3],[159,2,159,3],[160,2,160,3],[161,2,161,3],[162,2,162,3],[163,2,163,3],[146,2,146,3],[147,2,147,3],[148,2,148,3],[149,2,149,3],[150,2,150,3],[151,2,151,3],[152,2,152,3],[153,2,153,3],[154,2,154,3],[137,2,137,3],[138,2,138,3],[139,2,139,3],[140,2,140,3],[141,2,141,3],[142,2,142,3],[143,2,143,3],[144,2,144,3],[145,2,145,3],[128,2,128,3],[129,2,129,3],[130,2,130,3],[131,2,131,3],[132,2,132,3],[133,2,133,3],[134,2,134,3],[135,2,135,3],[136,2,136,3],[119,2,119,3],[120,2,120,3],[121,2,121,3],[122,2,122,3],[123,2,123,3],[124,2,124,3],[125,2,125,3],[126,2,126,3],[127,2,127,3],[110,2,110,3],[111,2,111,3],[112,2,112,3],[113,2,113,3],[114,2,114,3],[115,2,115,3],[116,2,116,3],[117,2,117,3],[118,2,118,3],[101,2,101,3],[102,2,102,3],[103,2,103,3],[104,2,104,3],[105,2,105,3],[106,2,106,3],[107,2,107,3],[108,2,108,3],[109,2,109,3],[92,2,92,3],[93,2,93,3],[94,2,94,3],[95,2,95,3],[96,2,96,3],[97,2,97,3],[98,2,98,3],[99,2,99,3],[100,2,100,3],[70,2,70,3],[71,2,71,3],[72,2,72,3],[73,2,73,3],[74,2,74,3],[75,2,75,3],[76,2,76,3],[77,2,77,3],[78,2,78,3],[79,2,79,3],[80,2,80,3],[81,2,81,3],[82,2,82,3],[83,2,83,3],[84,2,84,3],[85,2,85,3],[86,2,86,3],[87,2,87,3],[88,2,88,3],[89,2,89,3],[90,2,90,3],[91,2,91,3],[67,7,67,8],[67,9,67,10],[68,7,68,8],[68,9,68,10],[69,7,69,8],[69,9,69,10],[64,7,64,8],[64,9,64,10],[65,7,65,8],[65,9,65,10],[66,7,66,8],[66,9,66,10],[53,7,53,8],[53,9,53,10],[54,7,54,8],[54,9,54,10],[61,7,61,8],[61,9,61,10],[62,7,62,8],[62,9,62,10],[63,7,63,8],[63,9,63,10],[58,7,58,8],[58,9,58,10],[59,7,59,8],[59,9,59,10],[60,7,60,8],[60,9,60,10],[68,2,68,3],[69,2,69,3],[42,7,42,8],[42,9,42,10],[43,7,43,8],[43,9,43,10],[44,7,44,8],[44,9,44,10],[45,7,45,8],[45,9,45,10],[46,7,46,8],[46,9,46,10],[47,7,47,8],[47,9,47,10],[48,7,48,8],[48,9,48,10],[63,2,63,3],[64,2,64,3],[55,7,55,8],[55,9,55,10],[56,7,56,8],[56,9,56,10],[57,7,57,8],[57,9,57,10],[11,2,11,4],[8,5,9,5],[1,0,1,4],[1,5,1,11],[7,2,7,4],[67,2,67,3],[58,2,58,3],[59,2,59,3],[60,2,60,3],[61,2,61,3],[62,2,62,3],[53,2,53,3],[54,2,54,3],[55,2,55,3],[56,2,56,3],[57,2,57,3],[49,7,49,8],[49,9,49,10],[50,7,50,8],[50,9,50,10],[51,7,51,8],[51,9,51,10],[52,7,52,8],[52,9,52,10],[36,1,36,11],[37,1,37,11],[38,1,38,11],[39,1,39,11],[25,0,26,0],[0,0,0,11],[16,1,16,3],[10,2,10,4],[13,1,13,3],[14,1,14,3],[17,1,17,3],[11,6,11,11],[10,6,10,11],[13,0,19,0],[10,0,11,0],[13,8,13,11],[14,8,16,11],[6,0,6,11],[2,0,2,11],[3,0,3,11],[4,0,4,11],[5,0,5,11],[8,0,9,0],[8,2,8,4],[21,0,23,0],[13,5,13,7],[14,5,16,7],[15,1,15,3],[14,4,15,4],[22,4,22,5],[23,4,23,5],[22,1,22,3],[23,1,23,3],[19,1,19,3],[18,1,18,3],[17,5,19,11],[22,6,22,8],[23,6,23,8],[28,0,33,0],[28,1,28,7],[28,8,28,11],[29,1,33,1],[29,2,29,7],[30,2,30,7],[41,2,41,3],[41,7,41,8],[41,9,41,10],[43,2,43,3],[44,2,44,3],[45,2,45,3],[65,2,65,3],[66,2,66,3],[50,2,50,3],[51,2,51,3],[52,2,52,3],[31,2,31,7],[32,2,32,7],[42,2,42,3],[40,1,40,11],[34,1,34,11],[35,0,35,11],[7,7,7,8],[26,2,26,3],[8,7,8,9],[33,2,33,7],[29,8,33,11],[46,2,46,3],[47,2,47,3],[48,2,48,3],[49,2,49,3],[9,7,9,11],[21,9,21,11],[22,9,22,11],[23,9,23,11],[21,1,21,3],[21,4,21,5],[21,6,21,8],[9,2,9,4],[25,2,25,3],[25,4,25,7],[26,4,26,7],[25,10,25,11],[26,10,26,11],[25,8,25,9],[26,8,26,9]]}
["TREX Sample Submission"]
["Instructions and important notes",null,null,null,null,"Version 1.0"]
["1. Please complete this form electronically with detailed and accurate information. Fields marked with an asterisk (*) are required. Shaded areas are for TREX staff only; please do not edit/change."]
["2. Please send an electronic copy (Excel format) to TREX (trex_info@cornell.edu) BEFORE you submit your samples."]
["3. Please send samples in 1.5 ml microcentrifuge tubes. Incorrect tubes risk delays and handling fees."]
["4. When labeling bags or boxes for holding tubes please do NOT use Tape as it often comes off at -80. "]
[]
["For TREX use ONLY","Project ID #",null,null,null,"Submission Date",null,"Date Received",null,null,"QC Complete"]
["Project Information","Project Name*",null,null,null,"Primary Contact","Name*",null,null,null,"Initials*",{"$f":"LEFT($H$9)&IF(ISNUMBER(FIND(\" \",$H$9)),MID($H$9,FIND(\" \",$H$9)+1,1),\"\")&IF(ISNUMBER(FIND(\" \",$H$9,FIND(\" \",$H$9)+1)),MID($H$9,FIND(\" \",$H$9,FIND(\" \",$H$9)+1)+1,1),\"\")","v":""}]
[null,"Payment Method (Cornell Account)*",null,null,null,null,"e-mail*"]
{"$rows_left_out":186}
{"sheet":"Example","index":1,"n_rows":195,"n_cols":14,"rows_kept":195,"cut":false,"hidden":false,"merged":[[190,2,190,3],[190,7,190,8],[190,9,190,10],[191,2,191,3],[191,7,191,8],[191,9,191,10],[188,2,188,3],[188,7,188,8],[188,9,188,10],[189,2,189,3],[189,7,189,8],[189,9,189,10],[186,2,186,3],[186,7,186,8],[186,9,186,10],[187,2,187,3],[187,7,187,8],[187,9,187,10],[184,2,184,3],[184,7,184,8],[184,9,184,10],[185,2,185,3],[185,7,185,8],[185,9,185,10],[182,2,182,3],[182,7,182,8],[182,9,182,10],[183,2,183,3],[183,7,183,8],[183,9,183,10],[180,2,180,3],[180,7,180,8],[180,9,180,10],[181,2,181,3],[181,7,181,8],[181,9,181,10],[178,2,178,3],[178,7,178,8],[178,9,178,10],[179,2,179,3],[179,7,179,8],[179,9,179,10],[176,2,176,3],[176,7,176,8],[176,9,176,10],[177,2,177,3],[177,7,177,8],[177,9,177,10],[174,2,174,3],[174,7,174,8],[174,9,174,10],[175,2,175,3],[175,7,175,8],[175,9,175,10],[172,2,172,3],[172,7,172,8],[172,9,172,10],[173,2,173,3],[173,7,173,8],[173,9,173,10],[170,2,170,3],[170,7,170,8],[170,9,170,10],[171,2,171,3],[171,7,171,8],[171,9,171,10],[168,2,168,3],[168,7,168,8],[168,9,168,10],[169,2,169,3],[169,7,169,8],[169,9,169,10],[166,2,166,3],[166,7,166,8],[166,9,166,10],[167,2,167,3],[167,7,167,8],[167,9,167,10],[164,2,164,3],[164,7,164,8],[164,9,164,10],[165,2,165,3],[165,7,165,8],[165,9,165,10],[162,2,162,3],[162,7,162,8],[162,9,162,10],[163,2,163,3],[163,7,163,8],[163,9,163,10],[160,2,160,3],[160,7,160,8],[160,9,160,10],[161,2,161,3],[161,7,161,8],[161,9,161,10],[158,2,158,3],[158,7,158,8],[158,9,158,10],[159,2,159,3],[159,7,159,8],[159,9,159,10],[156,2,156,3],[156,7,156,8],[156,9,156,10],[157,2,157,3],[157,7,157,8],[157,9,157,10],[154,2,154,3],[154,7,154,8],[154,9,154,10],[155,2,155,3],[155,7,155,8],[155,9,155,10],[152,2,152,3],[152,7,152,8],[152,9,152,10],[153,2,153,3],[153,7,153,8],[153,9,153,10],[150,2,150,3],[150,7,150,8],[150,9,150,10],[151,2,151,3],[151,7,151,8],[151,9,151,10],[148,2,148,3],[148,7,148,8],[148,9,148,10],[149,2,149,3],[149,7,149,8],[149,9,149,10],[146,2,146,3],[146,7,146,8],[146,9,146,10],[147,2,147,3],[147,7,147,8],[147,9,147,10],[144,2,144,3],[144,7,144,8],[144,9,144,10],[145,2,145,3],[145,7,145,8],[145,9,145,10],[142,2,142,3],[142,7,142,8],[142,9,142,10],[143,2,143,3],[143,7,143,8],[143,9,143,10],[140,2,140,3],[140,7,140,8],[140,9,140,10],[141,2,141,3],[141,7,141,8],[141,9,141,10],[138,2,138,3],[138,7,138,8],[138,9,138,10],[139,2,139,3],[139,7,139,8],[139,9,139,10],[136,2,136,3],[136,7,136,8],[136,9,136,10],[137,2,137,3],[137,7,137,8],[137,9,137,10],[134,2,134,3],[134,7,134,8],[134,9,134,10],[135,2,135,3],[135,7,135,8],[135,9,135,10],[132,2,132,3],[132,7,132,8],[132,9,132,10],[133,2,133,3],[133,7,133,8],[133,9,133,10],[130,2,130,3],[130,7,130,8],[130,9,130,10],[131,2,131,3],[131,7,131,8],[131,9,131,10],[128,2,128,3],[128,7,128,8],[128,9,128,10],[129,2,129,3],[129,7,129,8],[129,9,129,10],[126,2,126,3],[126,7,126,8],[126,9,126,10],[127,2,127,3],[127,7,127,8],[127,9,127,10],[124,2,124,3],[124,7,124,8],[124,9,124,10],[125,2,125,3],[125,7,125,8],[125,9,125,10],[122,2,122,3],[122,7,122,8],[122,9,122,10],[123,2,123,3],[123,7,123,8],[123,9,123,10],[120,2,120,3],[120,7,120,8],[120,9,120,10],[121,2,121,3],[121,7,121,8],[121,9,121,10],[118,2,118,3],[118,7,118,8],[118,9,118,10],[119,2,119,3],[119,7,119,8],[119,9,119,10],[116,2,116,3],[116,7,116,8],[116,9,116,10],[117,2,117,3],[117,7,117,8],[117,9,117,10],[114,2,114,3],[114,7,114,8],[114,9,114,10],[115,2,115,3],[115,7,115,8],[115,9,115,10],[112,2,112,3],[112,7,112,8],[112,9,112,10],[113,2,113,3],[113,7,113,8],[113,9,113,10],[110,2,110,3],[110,7,110,8],[110,9,110,10],[111,2,111,3],[111,7,111,8],[111,9,111,10],[108,2,108,3],[108,7,108,8],[108,9,108,10],[109,2,109,3],[109,7,109,8],[109,9,109,10],[106,2,106,3],[106,7,106,8],[106,9,106,10],[107,2,107,3],[107,7,107,8],[107,9,107,10],[104,2,104,3],[104,7,104,8],[104,9,104,10],[105,2,105,3],[105,7,105,8],[105,9,105,10],[102,2,102,3],[102,7,102,8],[102,9,102,10],[103,2,103,3],[103,7,103,8],[103,9,103,10],[100,2,100,3],[100,7,100,8],[100,9,100,10],[101,2,101,3],[101,7,101,8],[101,9,101,10],[98,2,98,3],[98,7,98,8],[98,9,98,10],[99,2,99,3],[99,7,99,8],[99,9,99,10],[96,2,96,3],[96,7,96,8],[96,9,96,10],[97,2,97,3],[97,7,97,8],[97,9,97,10],[94,2,94,3],[94,7,94,8],[94,9,94,10],[95,2,95,3],[95,7,95,8],[95,9,95,10],[92,2,92,3],[92,7,92,8],[92,9,92,10],[93,2,93,3],[93,7,93,8],[93,9,93,10],[90,2,90,3],[90,7,90,8],[90,9,90,10],[91,2,91,3],[91,7,91,8],[91,9,91,10],[88,2,88,3],[88,7,88,8],[88,9,88,10],[89,2,89,3],[89,7,89,8],[89,9,89,10],[86,2,86,3],[86,7,86,8],[86,9,86,10],[87,2,87,3],[87,7,87,8],[87,9,87,10],[84,2,84,3],[84,7,84,8],[84,9,84,10],[85,2,85,3],[85,7,85,8],[85,9,85,10],[82,2,82,3],[82,7,82,8],[82,9,82,10],[83,2,83,3],[83,7,83,8],[83,9,83,10],[80,2,80,3],[80,7,80,8],[80,9,80,10],[81,2,81,3],[81,7,81,8],[81,9,81,10],[78,2,78,3],[78,7,78,8],[78,9,78,10],[79,2,79,3],[79,7,79,8],[79,9,79,10],[76,2,76,3],[76,7,76,8],[76,9,76,10],[77,2,77,3],[77,7,77,8],[77,9,77,10],[74,2,74,3],[74,7,74,8],[74,9,74,10],[75,2,75,3],[75,7,75,8],[75,9,75,10],[72,2,72,3],[72,7,72,8],[72,9,72,10],[73,2,73,3],[73,7,73,8],[73,9,73,10],[70,2,70,3],[70,7,70,8],[70,9,70,10],[71,2,71,3],[71,7,71,8],[71,9,71,10],[68,2,68,3],[68,7,68,8],[68,9,68,10],[69,2,69,3],[69,7,69,8],[69,9,69,10],[66,2,66,3],[66,7,66,8],[66,9,66,10],[67,2,67,3],[67,7,67,8],[67,9,67,10],[64,2,64,3],[64,7,64,8],[64,9,64,10],[65,2,65,3],[65,7,65,8],[65,9,65,10],[62,2,62,3],[62,7,62,8],[62,9,62,10],[63,2,63,3],[63,7,63,8],[63,9,63,10],[60,2,60,3],[60,7,60,8],[60,9,60,10],[61,2,61,3],[61,7,61,8],[61,9,61,10],[58,2,58,3],[58,7,58,8],[58,9,58,10],[59,2,59,3],[59,7,59,8],[59,9,59,10],[56,2,56,3],[56,7,56,8],[56,9,56,10],[57,2,57,3],[57,7,57,8],[57,9,57,10],[54,2,54,3],[54,7,54,8],[54,9,54,10],[55,2,55,3],[55,7,55,8],[55,9,55,10],[52,2,52,3],[52,7,52,8],[52,9,52,10],[53,2,53,3],[53,7,53,8],[53,9,53,10],[50,2,50,3],[50,7,50,8],[50,9,50,10],[51,2,51,3],[51,7,51,8],[51,9,51,10],[48,2,48,3],[48,7,48,8],[48,9,48,10],[49,2,49,3],[49,7,49,8],[49,9,49,10],[46,2,46,3],[46,7,46,8],[46,9,46,10],[47,2,47,3],[47,7,47,8],[47,9,47,10],[44,2,44,3],[44,7,44,8],[44,9,44,10],[45,2,45,3],[45,7,45,8],[45,9,45,10],[42,2,42,3],[42,7,42,8],[42,9,42,10],[43,2,43,3],[43,7,43,8],[43,9,43,10],[38,1,38,11],[39,1,39,11],[40,1,40,11],[41,2,41,3],[41,7,41,8],[41,9,41,10],[32,2,32,7],[33,2,33,7],[34,1,34,11],[35,0,35,11],[36,1,36,11],[37,1,37,11],[26,8,26,9],[26,10,26,11],[28,0,33,0],[28,1,28,7],[28,8,28,11],[29,1,33,1],[29,2,29,7],[29,8,33,11],[30,2,30,7],[31,2,31,7],[23,4,23,5],[23,6,23,8],[23,9,23,11],[25,0,26,0],[25,2,25,3],[25,4,25,7],[25,8,25,9],[25,10,25,11],[26,2,26,3],[26,4,26,7],[21,0,23,0],[21,1,21,3],[21,4,21,5],[21,6,21,8],[21,9,21,11],[22,1,22,3],[22,4,22,5],[22,6,22,8],[22,9,22,11],[23,1,23,3],[14,4,15,4],[14,5,16,7],[14,8,16,11],[15,1,15,3],[16,1,16,3],[17,1,17,3],[17,5,19,11],[18,1,18,3],[19,1,19,3],[10,0,11,0],[10,2,10,4],[10,6,10,11],[11,2,11,4],[11,6,11,11],[13,0,19,0],[13,1,13,3],[13,5,13,7],[13,8,13,11],[14,1,14,3],[5,0,5,11],[6,0,6,11],[7,2,7,4],[7,7,7,8],[8,0,9,0],[8,2,8,4],[8,5,9,5],[8,7,8,9],[9,2,9,4],[9,7,9,11],[0,0,0,11],[1,0,1,4],[1,5,1,11],[2,0,2,11],[3,0,3,11],[4,0,4,11]]}
["TREX Sample Submission"]
["Instructions and important notes",null,null,null,null,"Version 1.0"]
["1. Please complete this form electronically with detailed and accurate information. Fields marked with an asterisk (*) are required. Shaded areas are for TREX staff only; please do not edit/change."]
["2. Please send an electronic copy (Excel format) to TREX (trex_info@cornell.edu) BEFORE you submit your samples."]
["3. Please send samples in 1.5 ml microcentrifuge tubes. Incorrect tubes risk delays and handling fees."]
["4. When labeling bags or boxes for holding tubes please do NOT use Tape as it often comes off at -80. "]
[]
["For TREX use ONLY","Project ID #",null,null,null,"Submission Date",null,"Date Received",null,null,"QC Complete"]
["Project Information","Project Name*","My Research Topic",null,null,"Primary Contact","Name*","Jane Doe",null,null,"Initials*",{"$f":"LEFT($H$9)&IF(ISNUMBER(FIND(\" \",$H$9)),MID($H$9,FIND(\" \",$H$9)+1,1),\"\")&IF(ISNUMBER(FIND(\" \",$H$9,FIND(\" \",$H$9)+1)),MID($H$9,FIND(\" \",$H$9,FIND(\" \",$H$9)+1)+1,1),\"\")","v":"JD"}]
[null,"Payment Method (Cornell Account)*","101-0101",null,null,null,"e-mail*","jd01@cornell.edu"]
{"$rows_left_out":186}
{"sheet":"Source code","index":2,"n_rows":32,"n_cols":6,"rows_kept":32,"cut":false,"hidden":true,"merged":[]}
[]
[]
["Use this drop down menu to select quantification instrument","Use this drop down menu to select RNA enrichment method *",null,"Use this drop down menu to select library type *",null,"Use this drop down menu to select desired data output"]
["Qubit (or other intercalating dye system)","Poly A",null,"RNAseq - Stranded (default)",null,"Full HiSeq lane (110G)"]
["Nanodrop (please provide data)","Ribosomal Depletion: Human/Rat/Mouse (for animal samples)",null,"RNAseq - non stranded (low input)",null,"Equally shared HiSeq lane (≥2 libraries assigned to a particular lane)"]
["Other (Please describe in \"Notes\")","Ribosomal Depletion: Bacterial",null,"small RNA",null,"Unequally shared HiSeq lane (please give details in notes)"]
["None (Please describe why in \"Notes\")","Ribosomal Depletion: Plant  (must provide depletion kit)",null,null,null,"Full NovaSeq S2 flowcell (1T)"]
[null,"None",null,null,null,"Equally shared NovaSeq S2 flowcell (≥2 libraries assigned to a particular lane)"]
[null,"Cell Free RNA",null,null,null,"Unequally shared NovaSeq S2 flowcell (please give details in \"remarks\")"]
[null,"Other (Please clarify in \"Notes\")",null,null,null,"Full NovaSeq S4 lane (800G)"]
{"$rows_left_out":23}
{"sheet":"sample table mirror","index":3,"n_rows":153,"n_cols":20,"rows_kept":153,"cut":false,"hidden":true,"merged":[]}
["Customer Input Table Mirror",null,null,null,null,null,null,null,null,null,null,"Name Checks"]
["Library Name","Sample Name",null,"RQN","RNA Concentration","Volume","Group/Replicate ID",null,"Group 2/ Replicate ID",null,"Remarks","errors","has underscore?","any non-alphanumeric?","weird char","redundant","combined group repl count","combined group"]
[{"$f":"IF('Sample Information'!$A43=\"\",\"\",IF('Sample Information'!$L$9=\"\",\"INIT\",'Sample Information'!$L$9)&ROW(A3)-2)","v":""},{"$f":"IF('Sample Information'!C43=\"\",\"\",'Sample Information'!C43)","v":""},null,{"$f":"IF('Sample Information'!E43=\"\",\"\",'Sample Information'!E43)","v":""},{"$f":"IF('Sample Information'!F43=\"\",\"\",'Sample Information'!F43)","v":""},{"$f":"IF('Sample Information'!G43=\"\",\"\",'Sample Information'!G43)","v":""},{"$f":"IF('Sample Information'!H43=\"\",\"\",'Sample Information'!H43)","v":""},null,{"$f":"IF('Sample Information'!J43=\"\",\"\",'Sample Information'!J43)","v":""},null,{"$f":"IF('Sample Information'!L43=\"\",\"\",'Sample Information'!L43)","v":""},{"$f":"SUM(M3:N3)+IF(P3>1,10,0)+IF(AND(A3<>\"\",B3=\"\"),100,0)","v":0},{"$f":"IF(ISERROR(FIND(\"_\",B3)),0,1)","v":0},{"$f":"IF(LEN(O3)>0,1,0)","v":0},{"$f":"SUBSTITUTE(StripChar(B3),\"-\",\"\")","v":""},{"$f":"IF(B3=\"\",0,COUNTIF($B$3:$B$152,B3))","v":0},{"$f":"IF(R3=\"\",0,COUNTIF($R$3:$R$152,R3))","v":0},{"$f":"G3&I3","v":""}]
[{"$f":"IF('Sample Information'!$A44=\"\",\"\",IF('Sample Information'!$L$9=\"\",\"INIT\",'Sample Information'!$L$9)&ROW(A4)-2)","v":""},{"$f":"IF('Sample Information'!C44=\"\",\"\",'Sample Information'!C44)","v":""},null,{"$f":"IF('Sample Information'!E44=\"\",\"\",'Sample Information'!E44)","v":""},{"$f":"IF('Sample Information'!F44=\"\",\"\",'Sample Information'!F44)","v":""},{"$f":"IF('Sample Information'!G44=\"\",\"\",'Sample Information'!G44)","v":""},{"$f":"IF('Sample Information'!H44=\"\",\"\",'Sample Information'!H44)","v":""},null,{"$f":"IF('Sample Information'!J44=\"\",\"\",'Sample Information'!J44)","v":""},null,{"$f":"IF('Sample Information'!L44=\"\",\"\",'Sample Information'!L44)","v":""},{"$f":"SUM(M4:N4)+IF(P4>1,10,0)+IF(AND(A4<>\"\",B4=\"\"),100,0)","v":0},{"$f":"IF(ISERROR(FIND(\"_\",B4)),0,1)","v":0},{"$f":"IF(LEN(O4)>0,1,0)","v":0},{"$f":"SUBSTITUTE(StripChar(B4),\"-\",\"\")","v":""},{"$f":"IF(B4=\"\",0,COUNTIF($B$3:$B$152,B4))","v":0},{"$f":"IF(R4=\"\",0,COUNTIF($R$3:$R$152,R4))","v":0},{"$f":"G4&I4","v":""}]
[{"$f":"IF('Sample Information'!$A45=\"\",\"\",IF('Sample Information'!$L$9=\"\",\"INIT\",'Sample Information'!$L$9)&ROW(A5)-2)","v":""},{"$f":"IF('Sample Information'!C45=\"\",\"\",'Sample Information'!C45)","v":""},null,{"$f":"IF('Sample Information'!E45=\"\",\"\",'Sample Information'!E45)","v":""},{"$f":"IF('Sample Information'!F45=\"\",\"\",'Sample Information'!F45)","v":""},{"$f":"IF('Sample Information'!G45=\"\",\"\",'Sample Information'!G45)","v":""},{"$f":"IF('Sample Information'!H45=\"\",\"\",'Sample Information'!H45)","v":""},null,{"$f":"IF('Sample Information'!J45=\"\",\"\",'Sample Information'!J45)","v":""},null,{"$f":"IF('Sample Information'!L45=\"\",\"\",'Sample Information'!L45)","v":""},0,0,0,{"$f":"SUBSTITUTE(StripChar(B5),\"-\",\"\")","v":""},0,0,""]
[{"$f":"IF('Sample Information'!$A46=\"\",\"\",IF('Sample Information'!$L$9=\"\",\"INIT\",'Sample Information'!$L$9)&ROW(A6)-2)","v":""},{"$f":"IF('Sample Information'!C46=\"\",\"\",'Sample Information'!C46)","v":""},null,{"$f":"IF('Sample Information'!E46=\"\",\"\",'Sample Information'!E46)","v":""},{"$f":"IF('Sample Information'!F46=\"\",\"\",'Sample Information'!F46)","v":""},{"$f":"IF('Sample Information'!G46=\"\",\"\",'Sample Information'!G46)","v":""},{"$f":"IF('Sample Information'!H46=\"\",\"\",'Sample Information'!H46)","v":""},null,{"$f":"IF('Sample Information'!J46=\"\",\"\",'Sample Information'!J46)","v":""},null,{"$f":"IF('Sample Information'!L46=\"\",\"\",'Sample Information'!L46)","v":""},0,0,0,{"$f":"SUBSTITUTE(StripChar(B6),\"-\",\"\")","v":""},0,0,""]
[{"$f":"IF('Sample Information'!$A47=\"\",\"\",IF('Sample Information'!$L$9=\"\",\"INIT\",'Sample Information'!$L$9)&ROW(A7)-2)","v":""},{"$f":"IF('Sample Information'!C47=\"\",\"\",'Sample Information'!C47)","v":""},null,{"$f":"IF('Sample Information'!E47=\"\",\"\",'Sample Information'!E47)","v":""},{"$f":"IF('Sample Information'!F47=\"\",\"\",'Sample Information'!F47)","v":""},{"$f":"IF('Sample Information'!G47=\"\",\"\",'Sample Information'!G47)","v":""},{"$f":"IF('Sample Information'!H47=\"\",\"\",'Sample Information'!H47)","v":""},null,{"$f":"IF('Sample Information'!J47=\"\",\"\",'Sample Information'!J47)","v":""},null,{"$f":"IF('Sample Information'!L47=\"\",\"\",'Sample Information'!L47)","v":""},0,0,0,{"$f":"SUBSTITUTE(StripChar(B7),\"-\",\"\")","v":""},0,0,""]
[{"$f":"IF('Sample Information'!$A48=\"\",\"\",IF('Sample Information'!$L$9=\"\",\"INIT\",'Sample Information'!$L$9)&ROW(A8)-2)","v":""},{"$f":"IF('Sample Information'!C48=\"\",\"\",'Sample Information'!C48)","v":""},null,{"$f":"IF('Sample Information'!E48=\"\",\"\",'Sample Information'!E48)","v":""},{"$f":"IF('Sample Information'!F48=\"\",\"\",'Sample Information'!F48)","v":""},{"$f":"IF('Sample Information'!G48=\"\",\"\",'Sample Information'!G48)","v":""},{"$f":"IF('Sample Information'!H48=\"\",\"\",'Sample Information'!H48)","v":""},null,{"$f":"IF('Sample Information'!J48=\"\",\"\",'Sample Information'!J48)","v":""},null,{"$f":"IF('Sample Information'!L48=\"\",\"\",'Sample Information'!L48)","v":""},0,0,0,{"$f":"SUBSTITUTE(StripChar(B8),\"-\",\"\")","v":""},0,0,""]
[{"$f":"IF('Sample Information'!$A49=\"\",\"\",IF('Sample Information'!$L$9=\"\",\"INIT\",'Sample Information'!$L$9)&ROW(A9)-2)","v":""},{"$f":"IF('Sample Information'!C49=\"\",\"\",'Sample Information'!C49)","v":""},null,{"$f":"IF('Sample Information'!E49=\"\",\"\",'Sample Information'!E49)","v":""},{"$f":"IF('Sample Information'!F49=\"\",\"\",'Sample Information'!F49)","v":""},{"$f":"IF('Sample Information'!G49=\"\",\"\",'Sample Information'!G49)","v":""},{"$f":"IF('Sample Information'!H49=\"\",\"\",'Sample Information'!H49)","v":""},null,{"$f":"IF('Sample Information'!J49=\"\",\"\",'Sample Information'!J49)","v":""},null,{"$f":"IF('Sample Information'!L49=\"\",\"\",'Sample Information'!L49)","v":""},0,0,0,{"$f":"SUBSTITUTE(StripChar(B9),\"-\",\"\")","v":""},0,0,""]
[{"$f":"IF('Sample Information'!$A50=\"\",\"\",IF('Sample Information'!$L$9=\"\",\"INIT\",'Sample Information'!$L$9)&ROW(A10)-2)","v":""},{"$f":"IF('Sample Information'!C50=\"\",\"\",'Sample Information'!C50)","v":""},null,{"$f":"IF('Sample Information'!E50=\"\",\"\",'Sample Information'!E50)","v":""},{"$f":"IF('Sample Information'!F50=\"\",\"\",'Sample Information'!F50)","v":""},{"$f":"IF('Sample Information'!G50=\"\",\"\",'Sample Information'!G50)","v":""},{"$f":"IF('Sample Information'!H50=\"\",\"\",'Sample Information'!H50)","v":""},null,{"$f":"IF('Sample Information'!J50=\"\",\"\",'Sample Information'!J50)","v":""},null,{"$f":"IF('Sample Information'!L50=\"\",\"\",'Sample Information'!L50)","v":""},0,0,0,{"$f":"SUBSTITUTE(StripChar(B10),\"-\",\"\")","v":""},0,0,""]
{"$rows_left_out":143}